Target
Serine/threonine-protein kinase pim-1
Ligand
BDBM242380
Substrate
Meas. Tech.
Pim-1 Kinase Inhibition Assay
IC50
4.00±n/a nM
Citation
 Xu, YBrenning, BGKultgen, SGLiu, XSaunders, MDHo, K Substituted imidazo[1,2-B]pyridazines as protein kinase inhibitors US Patent  US10875864 Publication Date 12/29/2020 
Target
Name:
Serine/threonine-protein kinase pim-1
Synonyms:
PIM-1 Kinase PIM1_HUMAN Serine/threonine-protein kinase (PIM1) Serine/threonine-protein kinase PIM1 | Serine/threonine-protein kinase pim-1 (PIM1)
Type:
Protein
Mol. Mass.:
35681.82
Organism:
Homo sapiens (Human)
Description:
P11309
Residue:
313
  
Inhibitor
Name:
BDBM242380
Synonyms:
US10047093, 8-37 US10875864, EX. 8-37 | US9416132, 8-37
Type:
Small organic molecule
Emp. Form.:
C21H25ClN4O
Mol. Mass.:
384.902
SMILES:
CC(C)(O)[C@H]1CC[C@@H](CC1)Nc1ccc2ncc(-c3cccc(Cl)c3)n2n1
: