Target
Serine/threonine-protein kinase pim-1
Ligand
BDBM50043655
Substrate
Meas. Tech.
Pim-1 Kinase Inhibition Assay
IC50
24.0±n/a nM
Citation
 Xu, YBrenning, BGKultgen, SGLiu, XSaunders, MDHo, K Substituted imidazo[1,2-B]pyridazines as protein kinase inhibitors US Patent  US10875864 Publication Date 12/29/2020 
Target
Name:
Serine/threonine-protein kinase pim-1
Synonyms:
PIM-1 Kinase PIM1_HUMAN Serine/threonine-protein kinase (PIM1) Serine/threonine-protein kinase PIM1 | Serine/threonine-protein kinase pim-1 (PIM1)
Type:
Protein
Mol. Mass.:
35681.82
Organism:
Homo sapiens (Human)
Description:
P11309
Residue:
313
  
Inhibitor
Name:
BDBM50043655
Synonyms:
CHEMBL3355557 US10392392, Example 8-95 US9416132, 8-95
Type:
Small organic molecule
Emp. Form.:
C18H20ClN5
Mol. Mass.:
341.838
SMILES:
N[C@H]1CC[C@@H](CC1)Nc1ccn2ncc(-c3cccc(Cl)c3)c2n1
: