Target
Replicase polyprotein 1ab
Ligand
BDBM420298
Substrate
Meas. Tech.
fluorescence resonance energy transfer (FRET)-based CoV-2 3CLpro inhibition assay
IC50
8.00±1.00 nM
Citation
 Vankadara, SWong, YXLiu, BSee, YYTan, LHTan, QWWang, GKaruna, RGuo, XTan, STFong, JYJoy, JChia, CSB A head-to-head comparison of the inhibitory activities of 15 peptidomimetic SARS-CoV-2 3CLpro inhibitors. Bioorg Med Chem Lett 48:128263 (2021)  
Target
Name:
Replicase polyprotein 1ab
Synonyms:
3C-like proteinase 3C-like proteinase (SARS-CoV 3Cpro) 3CLp GFL Guanine-N7 methyltransferase Helicase Leader protein Non-structural protein 10 Non-structural protein 3 Non-structural protein 6 Non-structural protein 8 ORF1ab polyprotein PL2-PRO Pol R1AB_SARS RdRp SARS coronavirus main proteinase nsp1 nsp12 nsp14 nsp16 nsp3 nsp5 nsp7 nsp9 pp1ab | rep
Type:
Protein
Mol. Mass.:
790250.81
Organism:
Human SARS coronavirus (SARS-CoV) (Severe acute respiratory syndrome coronavirus)
Description:
P0C6X7
Residue:
7073
  
Inhibitor
Name:
BDBM420298
Synonyms:
CVD-0006356 PF-0835231 US11753373, Compound A-5-d WO2021205298, Compound 1 | cmdc.202100576, 6b
Type:
Small organic molecule
Emp. Form.:
C24H32N4O6
Mol. Mass.:
472.5341
SMILES:
COc1cccc2[nH]c(cc12)C(=O)N[C@@H](CC(C)C)C(=O)N[C@@H](C[C@@H]1CCNC1=O)C(=O)CO
: