Target
Transitional endoplasmic reticulum ATPase
Ligand
BDBM478253
Substrate
Meas. Tech.
Biomol Green Assay
IC50
20.0±n/a nM
Citation
 Huryn, DMWipf, PLaPorte, MG Modulators of P97 AAA ATPase activity US Patent  US10894782 Publication Date 1/19/2021 
Target
Name:
Transitional endoplasmic reticulum ATPase
Synonyms:
TERA_HUMAN VCP Valosin-containing protein
Type:
Enzyme
Mol. Mass.:
89300.63
Organism:
Homo sapiens (Human)
Description:
P55072
Residue:
806
  
Inhibitor
Name:
BDBM478253
Synonyms:
US10894782, No 106
Type:
Small organic molecule
Emp. Form.:
C24H24FN5O3S
Mol. Mass.:
481.542
SMILES:
CNC(=O)OCC#Cc1ccc(OCc2nnc(SC3CCCC3)n2-c2cccnc2)cc1F
: