Target
Transitional endoplasmic reticulum ATPase
Ligand
BDBM478271
Substrate
Meas. Tech.
Biomol Green Assay
IC50
10.00±n/a nM
Citation
 Huryn, DMWipf, PLaPorte, MG Modulators of P97 AAA ATPase activity US Patent  US10894782 Publication Date 1/19/2021 
Target
Name:
Transitional endoplasmic reticulum ATPase
Synonyms:
TERA_HUMAN VCP Valosin-containing protein
Type:
Enzyme
Mol. Mass.:
89300.63
Organism:
Homo sapiens (Human)
Description:
P55072
Residue:
806
  
Inhibitor
Name:
BDBM478271
Synonyms:
US10894782, No 124
Type:
Small organic molecule
Emp. Form.:
C29H32F2N6O3S
Mol. Mass.:
582.665
SMILES:
CN1CCC(CC1)NC(=O)OCC#Cc1cc(F)c(OCc2nnc(SC3CCCC3)n2-c2cccnc2)cc1F
: