Target
Orexin/Hypocretin receptor type 1
Ligand
BDBM479168
Substrate
Meas. Tech.
Orexin Receptor Cell-Based Functional Assay
IC50
4.00±n/a nM
Citation
 Kamenecka, TMHolenz, JWesolowski, SHe, YBürli, R Halo-substituted piperidines as orexin receptor modulators US Patent  US10894789 Publication Date 1/19/2021 
Target
Name:
Orexin/Hypocretin receptor type 1
Synonyms:
HCRTR1 OX1R_HUMAN Orexin receptor type 1 (OR 1) Orexin receptor type 1 (OX1) Orexin receptor type 1 (OxR1) | Ox1r
Type:
Protein
Mol. Mass.:
47554.50
Organism:
Homo sapiens (Human)
Description:
O43613
Residue:
425
  
Inhibitor
Name:
BDBM479168
Synonyms:
US10894789, Compound 124
Type:
Small organic molecule
Emp. Form.:
C24H25F5N6O2
Mol. Mass.:
524.4863
SMILES:
COc1cccc(c1)-c1cn(C)nc1C(=O)N1CC(F)(F)C[C@@H](C)C1CNc1cnc(cn1)C(F)(F)F
: