Target
Programmed cell death 1 ligand 1/2
Ligand
BDBM479655
Substrate
Meas. Tech.
Amplified Luminescent Proximity Homogeneous Assay
IC50
88.0±n/a nM
Citation
Target
Name:
Programmed cell death 1 ligand 1/2
Synonyms:
PD-1/PD-L1
Type:
Protein
Mol. Mass.:
Description:
Components:
This complex has 2 components.
Component 1
Name:
Programmed cell death 1 ligand 1
Synonyms:
B7 homolog 1 B7H1 CD274 PD-L1 PDCD1 ligand 1 PDCD1LG1 Programmed cell death 1 ligand 1 | Programmed death ligand 1
Type:
PROTEIN
Mol. Mass.:
33278.49
Organism:
Homo sapiens (Human)
Description:
ChEMBL_109807
Residue:
290
  
Component 2
Name:
Programmed cell death 1 ligand 2
Synonyms:
B7-DC Butyrophilin B7-DC CD_antigen=CD273 PD-L2 PDCD1 ligand 2 PDCD1LG2 Programmed cell death 1 ligand 2 | Programmed death ligand 2
Type:
PROTEIN
Mol. Mass.:
30963.56
Organism:
Homo sapiens
Description:
ChEMBL_114967
Residue:
273
  
Inhibitor
Name:
BDBM479655
Synonyms:
US10899735, No. 114
Type:
Small organic molecule
Emp. Form.:
C38H40Cl2N4O7
Mol. Mass.:
735.653
SMILES:
COc1cc(ccc1OCCN[C@@](C)(CO)C(O)=O)-c1cccc(c1Cl)-c1cccc(c1Cl)-c1ccc(CN2CC3(C2)CCC(=O)N3)c(OC)n1
: