Target
Interleukin-1 receptor-associated kinase 4
Ligand
BDBM480719
Substrate
Meas. Tech.
Transcreener-Fluorecescence Polarization Assay
Ki
1.40±n/a nM
Citation
 Bryan, MCDrobnick, JGobbi, AKatsumoto, TRajapaksa, NSKiefer, Jr., JR IRAK4 modulators US Patent  US10899774 Publication Date 1/26/2021 
Target
Name:
Interleukin-1 receptor-associated kinase 4
Synonyms:
IRAK-4 IRAK4_HUMAN Interleukin-1 receptor-associated kinase 4 (IRAK4) | Renal carcinoma antigen NY-REN-64
Type:
Protein
Mol. Mass.:
51519.08
Organism:
Homo sapiens (Human)
Description:
Q9NWZ3
Residue:
460
  
Inhibitor
Name:
BDBM480719
Synonyms:
N-(2,2-dimethyl-6-morpholino- 3H-benzofuran-5-yl)-2-(2-methyl- 4-pyridyl)oxazole-4-carboxamide | US10899774, Example 35
Type:
Small organic molecule
Emp. Form.:
C24H26N4O4
Mol. Mass.:
434.4876
SMILES:
Cc1cc(ccn1)-c1nc(co1)C(=O)Nc1cc2CC(C)(C)Oc2cc1N1CCOCC1
: