Target
Alpha-synuclein
Ligand
BDBM481153
Substrate
Meas. Tech.
In Vitro Direct Determination By Fluorescence
Kd
0.790±0.4 nM
Citation
 Routier, SSuzenet, FChalon, SBuron, FVercouillie, JMelki, RBoiaryna, LGuilloteau, DPieri, L Compounds for using in imaging and particularly for the diagnosis of neurodegenerative diseases US Patent  US10906900 Publication Date 2/2/2021 
Target
Name:
Alpha-synuclein
Synonyms:
NACP SNCA | SYUA_HUMAN
Type:
Protein
Mol. Mass.:
14451.42
Organism:
Homo sapiens (Human)
Description:
P37840
Residue:
140
  
Inhibitor
Name:
BDBM481153
Synonyms:
US10906900, Reference 22f
Type:
Small organic molecule
Emp. Form.:
C17H14FN3
Mol. Mass.:
279.3116
SMILES:
CN(C)c1ccc(cc1)C#Cc1cc2ccc(F)nc2[nH]1
: