Target
Alpha-synuclein
Ligand
BDBM481157
Substrate
Meas. Tech.
In Vitro Direct Determination By Fluorescence
Kd
0.490±0.2 nM
Citation
 Routier, SSuzenet, FChalon, SBuron, FVercouillie, JMelki, RBoiaryna, LGuilloteau, DPieri, L Compounds for using in imaging and particularly for the diagnosis of neurodegenerative diseases US Patent  US10906900 Publication Date 2/2/2021 
Target
Name:
Alpha-synuclein
Synonyms:
NACP SNCA | SYUA_HUMAN
Type:
Protein
Mol. Mass.:
14451.42
Organism:
Homo sapiens (Human)
Description:
P37840
Residue:
140
  
Inhibitor
Name:
BDBM481157
Synonyms:
US10906900, Reference 25a
Type:
Small organic molecule
Emp. Form.:
C21H17N3S
Mol. Mass.:
343.445
SMILES:
CN(C)c1ccc(cc1)C#Cc1cc2ccc(nc2[nH]1)-c1cccs1
: