Target
Alpha-synuclein
Ligand
BDBM50185987
Substrate
Meas. Tech.
In Vitro Direct Determination By Fluorescence
Kd
16.1±6 nM
Citation
 Routier, SSuzenet, FChalon, SBuron, FVercouillie, JMelki, RBoiaryna, LGuilloteau, DPieri, L Compounds for using in imaging and particularly for the diagnosis of neurodegenerative diseases US Patent  US10906900 Publication Date 2/2/2021 
Target
Name:
Alpha-synuclein
Synonyms:
NACP SNCA | SYUA_HUMAN
Type:
Protein
Mol. Mass.:
14451.42
Organism:
Homo sapiens (Human)
Description:
P37840
Residue:
140
  
Inhibitor
Name:
BDBM50185987
Synonyms:
2-(1-(6-((2-fluoroethyl)(methyl)amino)naphthalen-2-yl)ethylidene)malononitrile US10906900, FDDNP | US9452985, FDDNP (reference for comparison)
Type:
Small organic molecule
Emp. Form.:
C18H16FN3
Mol. Mass.:
293.3381
SMILES:
[#6]-[#7](-[#6]-[#6]F)-c1ccc2cc(ccc2c1)-[#6](\[#6])=[#6](\C#N)C#N
: