Target
Alpha-synuclein
Ligand
BDBM481150
Substrate
Meas. Tech.
In Vitro Direct Determination By Fluorescence
Kd
1.40±1 nM
Citation
 Routier, SSuzenet, FChalon, SBuron, FVercouillie, JMelki, RBoiaryna, LGuilloteau, DPieri, L Compounds for using in imaging and particularly for the diagnosis of neurodegenerative diseases US Patent  US10906900 Publication Date 2/2/2021 
Target
Name:
Alpha-synuclein
Synonyms:
NACP SNCA | SYUA_HUMAN
Type:
Protein
Mol. Mass.:
14451.42
Organism:
Homo sapiens (Human)
Description:
P37840
Residue:
140
  
Inhibitor
Name:
BDBM481150
Synonyms:
US10906900, Reference 22b
Type:
Small organic molecule
Emp. Form.:
C17H15N3
Mol. Mass.:
261.3211
SMILES:
CN(C)c1ccc(cc1)C#Cc1cc2ccncc2[nH]1
: