Target
Alpha-synuclein
Ligand
BDBM481160
Substrate
Meas. Tech.
In Vitro Direct Determination By Fluorescence
Kd
2.40±1 nM
Citation
 Routier, SSuzenet, FChalon, SBuron, FVercouillie, JMelki, RBoiaryna, LGuilloteau, DPieri, L Compounds for using in imaging and particularly for the diagnosis of neurodegenerative diseases US Patent  US10906900 Publication Date 2/2/2021 
Target
Name:
Alpha-synuclein
Synonyms:
NACP SNCA | SYUA_HUMAN
Type:
Protein
Mol. Mass.:
14451.42
Organism:
Homo sapiens (Human)
Description:
P37840
Residue:
140
  
Inhibitor
Name:
BDBM481160
Synonyms:
US10906900, Reference 28
Type:
Small organic molecule
Emp. Form.:
C18H16FN3
Mol. Mass.:
293.3381
SMILES:
CN(CCF)c1ccc(cc1)C#Cc1cc2cccnc2[nH]1
: