Target
Leucine-rich repeat serine/threonine-protein kinase 2 [1326-2527,G2019S]
Ligand
BDBM481880
Substrate
Meas. Tech.
Enzyme Assay
IC50
4.40±n/a nM
Citation
 Gray, NSHatcher, JChoi, HG LRRK2 inhibitors and methods of making and using the same US Patent  US10913744 Publication Date 2/9/2021 
Target
Name:
Leucine-rich repeat serine/threonine-protein kinase 2 [1326-2527,G2019S]
Synonyms:
GST-LRRK2 (aa 1326-2527,G2019S) LRRK2_HUMAN | PARK8
Type:
Mol. Mass.:
136848.23
Organism:
Homo sapiens (Human)
Description:
Q5S007[1326-2527,G2019S]
Residue:
1202
  
Inhibitor
Name:
BDBM481880
Synonyms:
US10913744, Compound 19
Type:
Small organic molecule
Emp. Form.:
C20H23ClN6O3
Mol. Mass.:
430.888
SMILES:
CCNc1nc(Nc2ccc(cc2OC)C(=O)N2CCOCC2)nc2[nH]cc(Cl)c12
: