Target
Cyclin-dependent kinase 4/G1/S-specific cyclin-D1
Ligand
BDBM7646
Substrate
GST-Rb fusion protein
Meas. Tech.
CDK Assay
pH
7±n/a
Temperature
295.15±n/a K
IC50
150±n/a nM
Citation
 Anderson, MBeattie, JFBreault, GABreed, JByth, KFCulshaw, JDEllston, RPGreen, SMinshull, CANorman, RAPauptit, RAStanway, JThomas, APJewsbury, PJ Imidazo[1,2-a]pyridines: a potent and selective class of cyclin-dependent kinase inhibitors identified through structure-based hybridisation. Bioorg Med Chem Lett 13:3021-6 (2003)  
Target
Name:
Cyclin-dependent kinase 4/G1/S-specific cyclin-D1
Synonyms:
CDK4/CycD CDK4/Cyclin D1 Cyclin-Dependent Kinase 4 (CDK4) Cyclin-dependent kinase 4/G1/S-specific cyclin D1 | Cyclin-dependent kinase 4/cyclin D1
Type:
Protein Complex
Mol. Mass.:
Description:
CDK4/D1 complexes were purified from insect cells co-infected with baculovirus vectors containing each of the components.
Components:
This complex has 2 components.
Component 1
Name:
Cyclin-dependent kinase 4
Synonyms:
CDK4 Cell division protein kinase 4 PSK-J3
Type:
Enzyme Subunit
Mol. Mass.:
33731.96
Organism:
Homo sapiens (Human)
Description:
P11802
Residue:
303
  
Component 2
Name:
G1/S-specific cyclin-D1
Synonyms:
B-cell lymphoma 1 protein BCL-1 oncogene CCND1 PRAD1 | PRAD1 oncogene
Type:
Enzyme Subunit
Mol. Mass.:
33717.70
Organism:
Homo sapiens (Human)
Description:
Residue:
295
  
Inhibitor
Name:
BDBM7646
Synonyms:
CHEMBL102926 N-{4-[3-(dimethylamino)-2-hydroxypropoxy]phenyl}-4-{2-methylimidazo[1,2-a]pyridin-3-yl}pyrimidin-2-amine
Type:
Small organic molecule
Emp. Form.:
C23H26N6O2
Mol. Mass.:
418.4915
SMILES:
CN(C)CC(O)COc1ccc(Nc2nccc(n2)-c2c(C)nc3ccccn23)cc1
:
Substrate
Name:
GST-Rb fusion protein
Synonyms:
Glutathione S-transferase (GST)-retinoblastoma (Rb) fusion RB1 Rb | retinoblastoma
Type:
Other Protein Type
Mol. Mass.:
106410.17
Organism:
Homo sapiens (Human)
Description:
GST-60 kDa Rb fusion protein (comprising amino acids 378 to 928 of retinoblastoma)
Residue:
928