Target
Beta-3 adrenergic receptor
Ligand
BDBM484045
Substrate
Meas. Tech.
Homogeneous Time-Resolved Fluorescence Assay
IC50
25120±n/a nM
Citation
 Tran, TDo, QUllman, BBlackburn, ACNagura, M Modulators of the beta-3 adrenergic receptor useful for the treatment or prevention of disorders related thereto US Patent  US10927123 Publication Date 2/23/2021 
Target
Name:
Beta-3 adrenergic receptor
Synonyms:
ADRB3 ADRB3_HUMAN Beta-2 adrenergic receptor and beta-3 adrenergic receptor Beta-3 adrenoreceptor | adrenergic Beta3
Type:
G Protein-Coupled Receptor (GPCR)
Mol. Mass.:
43534.88
Organism:
Homo sapiens (Human)
Description:
Residue:
408
  
Inhibitor
Name:
BDBM484045
Synonyms:
(S)-1-(3-(2- hydroxyethylsulfonyl) phenoxy)-3-(R)-8- (quinolin-3-ylsulfonyl)- 1-oxa-8- azaspiro[4.5]decan-3- ylamino)propan-2-ol | US10927123, Compound 88
Type:
Small organic molecule
Emp. Form.:
C28H35N3O8S2
Mol. Mass.:
605.723
SMILES:
OCCS(=O)(=O)c1cccc(OC[C@@H](O)CN[C@H]2COC3(C2)CCN(CC3)S(=O)(=O)c2cnc3ccccc3c2)c1
: