Target
Beta-3 adrenergic receptor
Ligand
BDBM484049
Substrate
Meas. Tech.
Homogeneous Time-Resolved Fluorescence Assay
IC50
21140±n/a nM
Citation
 Tran, TDo, QUllman, BBlackburn, ACNagura, M Modulators of the beta-3 adrenergic receptor useful for the treatment or prevention of disorders related thereto US Patent  US10927123 Publication Date 2/23/2021 
Target
Name:
Beta-3 adrenergic receptor
Synonyms:
ADRB3 ADRB3_HUMAN Beta-2 adrenergic receptor and beta-3 adrenergic receptor Beta-3 adrenoreceptor | adrenergic Beta3
Type:
G Protein-Coupled Receptor (GPCR)
Mol. Mass.:
43534.88
Organism:
Homo sapiens (Human)
Description:
Residue:
408
  
Inhibitor
Name:
BDBM484049
Synonyms:
(S)-1-((R)-8-(4'- (aminomethyl)-4- ethoxybiphenyl-3- ylsulfonyl)-l-oxa-8- azaspiro[4.5]decan-3- ylamino)-3-(3-(1,1- difluoro-2- hydroxyethylsulfonyl) phenoxy)propan-2-ol | US10927123, Compound 161
Type:
Small organic molecule
Emp. Form.:
C34H43F2N3O9S2
Mol. Mass.:
739.847
SMILES:
CCOc1ccc(cc1S(=O)(=O)N1CCC2(C[C@H](CO2)NC[C@H](O)COc2cccc(c2)S(=O)(=O)C(F)(F)CO)CC1)-c1ccc(CN)cc1
: