Target
Beta-3 adrenergic receptor
Ligand
BDBM484050
Substrate
Meas. Tech.
Homogeneous Time-Resolved Fluorescence Assay
IC50
17310±n/a nM
Citation
 Tran, TDo, QUllman, BBlackburn, ACNagura, M Modulators of the beta-3 adrenergic receptor useful for the treatment or prevention of disorders related thereto US Patent  US10927123 Publication Date 2/23/2021 
Target
Name:
Beta-3 adrenergic receptor
Synonyms:
ADRB3 ADRB3_HUMAN Beta-2 adrenergic receptor and beta-3 adrenergic receptor Beta-3 adrenoreceptor | adrenergic Beta3
Type:
G Protein-Coupled Receptor (GPCR)
Mol. Mass.:
43534.88
Organism:
Homo sapiens (Human)
Description:
Residue:
408
  
Inhibitor
Name:
BDBM484050
Synonyms:
(S)-1-((S)-8-(4'- (aminomethyl)-4- ethoxybiphenyl-3- ylsulfonyl)-l-oxa-8- azaspiro[4.5]decan-3- ylamino)-3-(3-(1- (hydroxymethyl) cyclopropylsulfonyl) phenoxy)propan-2-ol | US10927123, Compound 163
Type:
Small organic molecule
Emp. Form.:
C36H47N3O9S2
Mol. Mass.:
729.903
SMILES:
CCOc1ccc(cc1S(=O)(=O)N1CCC2(C[C@@H](CO2)NC[C@H](O)COc2cccc(c2)S(=O)(=O)C2(CO)CC2)CC1)-c1ccc(CN)cc1
: