Target
Replicase polyprotein 1ab
Ligand
BDBM448319
Substrate
Meas. Tech.
Enzymatic Inhibition of UAWJ9-36-1 and UAWJ9-36-3 against the Mpro's from Seven Human Coronaviruses
IC50
44±4.40 nM
Citation
 Xia, ZSacco, MHu, YMa, CMeng, XZhang, FSzeto, TXiang, YChen, YWang, J Rational Design of Hybrid SARS-CoV-2 Main Protease Inhibitors Guided by the Superimposed Cocrystal Structures with the Peptidomimetic Inhibitors GC-376, Telaprevir, and Boceprevir. ACS Pharmacol Transl Sci 4:1408-1421 (2021)  
Target
Name:
Replicase polyprotein 1ab
Synonyms:
3C-like proteinase 3C-like proteinase (SARS-CoV 3Cpro) 3CLp GFL Guanine-N7 methyltransferase Helicase Leader protein Non-structural protein 10 Non-structural protein 3 Non-structural protein 6 Non-structural protein 8 ORF1ab polyprotein PL2-PRO Pol R1AB_SARS RdRp SARS coronavirus main proteinase nsp1 nsp12 nsp14 nsp16 nsp3 nsp5 nsp7 nsp9 pp1ab | rep
Type:
Protein
Mol. Mass.:
790250.81
Organism:
Human SARS coronavirus (SARS-CoV) (Severe acute respiratory syndrome coronavirus)
Description:
P0C6X7
Residue:
7073
  
Inhibitor
Name:
BDBM448319
Synonyms:
GC-376 | GC376
Type:
Small organic molecule
Emp. Form.:
C21H30N3O8S
Mol. Mass.:
484.544
SMILES:
CC(C)C[C@H](NC(=O)OCc1ccccc1)C(=O)N[C@@H](CC1CCNC1=O)C(O)S([O-])(=O)=O
: