Target
Serine hydroxymethyltransferase, cytosolic
Ligand
BDBM285666
Substrate
Meas. Tech.
Enzymatic Assay
IC50
4.00±n/a nM
Citation
 Rabinowitz, JDKim, HDucker, GSGhergurovich, JM SHMT inhibitors US Patent  US10934305 Publication Date 3/2/2021 
Target
Name:
Serine hydroxymethyltransferase, cytosolic
Synonyms:
GLYC_HUMAN SHMT Serine methylase
Type:
PROTEIN
Mol. Mass.:
53091.10
Organism:
Homo sapiens (Human)
Description:
ChEMBL_745716
Residue:
483
  
Inhibitor
Name:
BDBM285666
Synonyms:
US10077273, Compound 2 US10934305, Compound 2
Type:
Small organic molecule
Emp. Form.:
C22H21F3N4O2
Mol. Mass.:
430.4229
SMILES:
CC(C)C1(c2c(C)n[nH]c2OC(N)=C1C#N)c1cc(cc(c1)C(F)(F)F)C#CCCO
: