Target
Tyrosine-protein kinase BTK
Ligand
BDBM485359
Substrate
Meas. Tech.
Kinase Lanthascreen Binding Assay
IC50
8.13±n/a nM
Citation
 Arora, NBacani, GMBarbay, JKBembenek, SDCai, MChen, WDeckhut, CPEdwards, JPGhosh, BKreutter, KDLi, GTichenor, MSVenable, JDWei, JWiener, JJWu, YXiao, KZhang, FZhu, Y Inhibitors of Bruton's tyrosine kinase and method of their use US Patent  US10934310 Publication Date 3/2/2021 
Target
Name:
Tyrosine-protein kinase BTK
Synonyms:
AGMX1 Agammaglobulinaemia tyrosine kinase B cell progenitor kinase BPK BTK_HUMAN Tyrosine Kinase BTK Tyrosine-protein kinase BTK (BTK)
Type:
Enzyme
Mol. Mass.:
76289.95
Organism:
Homo sapiens (Human)
Description:
Q06187
Residue:
659
  
Inhibitor
Name:
BDBM485359
Synonyms:
5-([1,1'-Biphenyl]-3-yl)-N-((1R,2S)-2-acrylamidocyclopentyl)-4- oxo-4,5-dihydro-3H-1-thia-3,5,8-triazaacenaphthylene-2- carboxamide US11319329, Ex # 193
Type:
Small organic molecule
Emp. Form.:
C29H25N5O3S
Mol. Mass.:
523.606
SMILES:
C=CC(=O)N[C@H]1CCC[C@H]1NC(=O)c1sc2nccc3n(-c4cccc(c4)-c4ccccc4)c(=O)[nH]c1c23
: