Target
Tyrosine-protein kinase BTK
Ligand
BDBM485365
Substrate
Meas. Tech.
Kinase Lanthascreen Binding Assay
IC50
7.41±n/a nM
Citation
 Arora, NBacani, GMBarbay, JKBembenek, SDCai, MChen, WDeckhut, CPEdwards, JPGhosh, BKreutter, KDLi, GTichenor, MSVenable, JDWei, JWiener, JJWu, YXiao, KZhang, FZhu, Y Inhibitors of Bruton's tyrosine kinase and method of their use US Patent  US10934310 Publication Date 3/2/2021 
Target
Name:
Tyrosine-protein kinase BTK
Synonyms:
AGMX1 Agammaglobulinaemia tyrosine kinase B cell progenitor kinase BPK BTK_HUMAN Tyrosine Kinase BTK Tyrosine-protein kinase BTK (BTK)
Type:
Enzyme
Mol. Mass.:
76289.95
Organism:
Homo sapiens (Human)
Description:
Q06187
Residue:
659
  
Inhibitor
Name:
BDBM485365
Synonyms:
N-((1R,2S)-2-Acrylamidocyclopentyl)-5-(2-methyl-4-(pyridin-3- yloxy)phenyl)-4-oxo-4,5-dihydro-3H-1-thia-3,5,8- triazaacenaphthylene-2-carboxamide US11319329, Ex # 199
Type:
Small organic molecule
Emp. Form.:
C29H26N6O4S
Mol. Mass.:
554.62
SMILES:
Cc1cc(Oc2cccnc2)ccc1-n1c2ccnc3sc(C(=O)N[C@@H]4CCC[C@@H]4NC(=O)C=C)c([nH]c1=O)c23
: