Target
Bromodomain-containing protein 4
Ligand
BDBM285001
Substrate
Meas. Tech.
In Vitro Enzyme Inhibition Assay
IC50
<500±n/a nM
Citation
 Boloor, A Bromodomain inhibitors US Patent  US10941160 Publication Date 3/9/2021 
Target
Name:
Bromodomain-containing protein 4
Synonyms:
BRD4 Bromodomain-containing protein 4 (BRD4) Protein HUNK1
Type:
Protein
Mol. Mass.:
152264.84
Organism:
Homo sapiens (Human)
Description:
O60885
Residue:
1362
  
Inhibitor
Name:
BDBM285001
Synonyms:
4-[2-(cyclopropylmethoxy)-5- methylsulfonylphenyl]-2-methyl-6-(1- methylpyrazol-4-yl)isoquinolin-1-one US10023592, Example 46
Type:
Small organic molecule
Emp. Form.:
C25H25N3O4S
Mol. Mass.:
463.549
SMILES:
Cn1cc(cn1)-c1ccc2c(c1)c(cn(C)c2=O)-c1cc(ccc1OCC1CC1)S(C)(=O)=O
: