Target
Bromodomain-containing protein 4
Ligand
BDBM486259
Substrate
Meas. Tech.
In Vitro Enzyme Inhibition Assay
IC50
<500±n/a nM
Citation
 Boloor, A Bromodomain inhibitors US Patent  US10941160 Publication Date 3/9/2021 
Target
Name:
Bromodomain-containing protein 4
Synonyms:
BRD4 Bromodomain-containing protein 4 (BRD4) Protein HUNK1
Type:
Protein
Mol. Mass.:
152264.84
Organism:
Homo sapiens (Human)
Description:
O60885
Residue:
1362
  
Inhibitor
Name:
BDBM486259
Synonyms:
3-(dimethylamino)-5-(2-ethoxy-5- ethylsulfonylphenyl)-1-methylpyridin-2-one | US10941160, Example 469
Type:
Small organic molecule
Emp. Form.:
C18H26N2O4S
Mol. Mass.:
366.475
SMILES:
CCOc1ccc(cc1-c1cc(N(C)C)c(=O)n(C)c1)S(O)(O)CC
: