Target
Bromodomain-containing protein 4
Ligand
BDBM486260
Substrate
Meas. Tech.
In Vitro Enzyme Inhibition Assay
IC50
<500±n/a nM
Citation
 Boloor, A Bromodomain inhibitors US Patent  US10941160 Publication Date 3/9/2021 
Target
Name:
Bromodomain-containing protein 4
Synonyms:
BRD4 Bromodomain-containing protein 4 (BRD4) Protein HUNK1
Type:
Protein
Mol. Mass.:
152264.84
Organism:
Homo sapiens (Human)
Description:
O60885
Residue:
1362
  
Inhibitor
Name:
BDBM486260
Synonyms:
5-[2-(2,4-difluorophenoxy)-5- (methylsulfonylmethy)phenyl]-1- methylpyridin-2-one | US10941160, Example 470
Type:
Small organic molecule
Emp. Form.:
C20H17F2NO3S
Mol. Mass.:
389.416
SMILES:
Cn1cc(ccc1=O)-c1cc(CS(C)=O)ccc1Oc1ccc(F)cc1F
: