Target
Bromodomain-containing protein 4
Ligand
BDBM486274
Substrate
Meas. Tech.
In Vitro Enzyme Inhibition Assay
IC50
<500±n/a nM
Citation
 Boloor, A Bromodomain inhibitors US Patent  US10941160 Publication Date 3/9/2021 
Target
Name:
Bromodomain-containing protein 4
Synonyms:
BRD4 Bromodomain-containing protein 4 (BRD4) Protein HUNK1
Type:
Protein
Mol. Mass.:
152264.84
Organism:
Homo sapiens (Human)
Description:
O60885
Residue:
1362
  
Inhibitor
Name:
BDBM486274
Synonyms:
N-[3-(1-cyclobutyl-5-methyl-6-oxopyridin-3- yl)-4-(2,4-difluorophenoxy)phenyl] methanesulfonamide | US10941160, Example 484
Type:
Small organic molecule
Emp. Form.:
C23H22F2N2O3S
Mol. Mass.:
444.494
SMILES:
Cc1cc(cn(C2CCC2)c1=O)-c1cc(NS(C)=O)ccc1Oc1ccc(F)cc1F
: