Target
Bromodomain-containing protein 4
Ligand
BDBM285439
Substrate
Meas. Tech.
In Vitro Enzyme Inhibition Assay
IC50
<500±n/a nM
Citation
 Boloor, A Bromodomain inhibitors US Patent  US10941160 Publication Date 3/9/2021 
Target
Name:
Bromodomain-containing protein 4
Synonyms:
BRD4 Bromodomain-containing protein 4 (BRD4) Protein HUNK1
Type:
Protein
Mol. Mass.:
152264.84
Organism:
Homo sapiens (Human)
Description:
O60885
Residue:
1362
  
Inhibitor
Name:
BDBM285439
Synonyms:
4-(2-cyclopropyl-5-methylsulfonyl-2,3- dihydro-1-benzofuran-7-yl)-2- methylisoquinolin-1-one US10023592, Example 493
Type:
Small organic molecule
Emp. Form.:
C22H21NO4S
Mol. Mass.:
395.471
SMILES:
Cn1cc(-c2cc(cc3CC(Oc23)C2CC2)S(C)(=O)=O)c2ccccc2c1=O
: