Target
Bromodomain-containing protein 4
Ligand
BDBM285444
Substrate
Meas. Tech.
In Vitro Enzyme Inhibition Assay
IC50
<500±n/a nM
Citation
 Boloor, A Bromodomain inhibitors US Patent  US10941160 Publication Date 3/9/2021 
Target
Name:
Bromodomain-containing protein 4
Synonyms:
BRD4 Bromodomain-containing protein 4 (BRD4) Protein HUNK1
Type:
Protein
Mol. Mass.:
152264.84
Organism:
Homo sapiens (Human)
Description:
O60885
Residue:
1362
  
Inhibitor
Name:
BDBM285444
Synonyms:
5-[3-(methoxymethyl)-7-methylsulfonyl-2,3- dihydro-1,4-benzodioxin-5-yl]-1,3- dimethylpyridin-2-one US10023592, Example 498 | US10023592, Example 500
Type:
Small organic molecule
Emp. Form.:
C18H21NO6S
Mol. Mass.:
379.427
SMILES:
COCC1COc2cc(cc(-c3cc(C)c(=O)n(C)c3)c2O1)S(C)(=O)=O
: