Target
Nuclear receptor subfamily 1 group I member 2
Ligand
BDBM429596
Substrate
Meas. Tech.
hPXR Tranxactivation Assays
IC50
80.0±n/a nM
Citation
 Chen, TLin, WWang, Y 1,4,5-substituted 1,2,3-triazole analogues as antagonists of the pregnane X receptor US Patent  US10947203 Publication Date 3/16/2021 
Target
Name:
Nuclear receptor subfamily 1 group I member 2
Synonyms:
NR1I2 Orphan nuclear receptor PAR1 PXR SXR nuclear receptor subfamily 1 group I member 2 isoform 1
Type:
Nuclear receptor
Mol. Mass.:
49774.77
Organism:
Homo sapiens (Human)
Description:
O75469
Residue:
434
  
Inhibitor
Name:
BDBM429596
Synonyms:
US10550091, No. LC-5 | US10947203, No. LC-5
Type:
Small organic molecule
Emp. Form.:
C21H25N3O3S
Mol. Mass.:
399.507
SMILES:
COc1ccc(C)cc1-n1nnc(c1C)S(=O)(=O)c1ccc(cc1)C(C)(C)C
: