Target
Nuclear receptor subfamily 1 group I member 2
Ligand
BDBM429605
Substrate
Meas. Tech.
PXR BINDING ASSAY
IC50
100.0±n/a nM
Citation
 Chen, TLin, WWang, Y 1,4,5-substituted 1,2,3-triazole analogues as antagonists of the pregnane X receptor US Patent  US10947203 Publication Date 3/16/2021 
Target
Name:
Nuclear receptor subfamily 1 group I member 2
Synonyms:
NR1I2 Orphan nuclear receptor PAR1 PXR SXR nuclear receptor subfamily 1 group I member 2 isoform 1
Type:
Nuclear receptor
Mol. Mass.:
49774.77
Organism:
Homo sapiens (Human)
Description:
O75469
Residue:
434
  
Inhibitor
Name:
BDBM429605
Synonyms:
US10550091, No. LC-14 | US10947203, No. LC-14
Type:
Small organic molecule
Emp. Form.:
C22H27N3O5S
Mol. Mass.:
445.532
SMILES:
COc1cc(OC)c(cc1OC)-n1nnc(c1C)S(=O)(=O)c1ccc(cc1)C(C)(C)C
: