Target
L-lactate dehydrogenase A chain
Ligand
BDBM488148
Substrate
Meas. Tech.
Biochemical Assay
IC50
<100±n/a nM
Citation
 Maloney, DJWaterson, AGBantukallu, GRBrimacombe, KRChristov, PDang, CVDarley-Usmar, VMHall, MHu, XJadhav, AJana, SKim, KMoore, WJMott, BTNeckers, LMSimeonov, ASulikowski, GAUrban, DJYang, SM 1 H-pyrazol-1-yl-thiazoles as inhibitors of lactate dehydrogenase and methods of use thereof US Patent  US10954228 Publication Date 3/23/2021 
Target
Name:
L-lactate dehydrogenase A chain
Synonyms:
Cell proliferation-inducing gene 19 protein L-lactate dehydrogenase A Chain LDH-A LDHA Lactate dehydrogenase A (LDHA) | Renal carcinoma antigen NY-REN-59
Type:
Protein
Mol. Mass.:
36694.85
Organism:
Homo sapiens (Human)
Description:
P00338::PDB Code: 4ajp
Residue:
332
  
Inhibitor
Name:
BDBM488148
Synonyms:
2-(5-(2-cyclopropylethyl)-3-(4- fluoro-3-((5- methylthiophen-2-yl) ethynyl)phenyl)-4-(3-fluoro-4- sulfamoylbenzyl)-1H-pyrazol-1- yl)thiazole-4- carboxylic acid | US10954228, Compound 113
Type:
Small organic molecule
Emp. Form.:
C32H27F2N4O3S3
Mol. Mass.:
649.773
SMILES:
Cc1ccc(s1)C#Cc1cc(ccc1F)-c1nn(c(CCC2CC2)c1Cc1ccc(c(F)c1)[SH+](N)=O)-c1nc(cs1)C(O)=O
: