Target
L-lactate dehydrogenase A chain
Ligand
BDBM488177
Substrate
Meas. Tech.
Biochemical Assay
IC50
<100±n/a nM
Citation
 Maloney, DJWaterson, AGBantukallu, GRBrimacombe, KRChristov, PDang, CVDarley-Usmar, VMHall, MHu, XJadhav, AJana, SKim, KMoore, WJMott, BTNeckers, LMSimeonov, ASulikowski, GAUrban, DJYang, SM 1 H-pyrazol-1-yl-thiazoles as inhibitors of lactate dehydrogenase and methods of use thereof US Patent  US10954228 Publication Date 3/23/2021 
Target
Name:
L-lactate dehydrogenase A chain
Synonyms:
Cell proliferation-inducing gene 19 protein L-lactate dehydrogenase A Chain LDH-A LDHA Lactate dehydrogenase A (LDHA) | Renal carcinoma antigen NY-REN-59
Type:
Protein
Mol. Mass.:
36694.85
Organism:
Homo sapiens (Human)
Description:
P00338::PDB Code: 4ajp
Residue:
332
  
Inhibitor
Name:
BDBM488177
Synonyms:
2-(5-(cyclopropylmethyl)-4- (3-fluoro-4-sulfamoylbenzyl)-3- (3-((cis)-3-(5-methylthiophen-2- yl)cyclobutyl)phenyl)-1H-pyrazol- 1-yl)thiazole-4-carboxylic acid | US10954228, Compound 132
Type:
Small organic molecule
Emp. Form.:
C33H32FN4O3S3
Mol. Mass.:
647.825
SMILES:
Cc1ccc(s1)[C@H]1C[C@H](C1)c1cccc(c1)-c1nn(c(CC2CC2)c1Cc1ccc(c(F)c1)[SH+](N)=O)-c1nc(cs1)C(O)=O
: