Target
L-lactate dehydrogenase A chain
Ligand
BDBM488188
Substrate
Meas. Tech.
Biochemical Assay
IC50
<100±n/a nM
Citation
 Maloney, DJWaterson, AGBantukallu, GRBrimacombe, KRChristov, PDang, CVDarley-Usmar, VMHall, MHu, XJadhav, AJana, SKim, KMoore, WJMott, BTNeckers, LMSimeonov, ASulikowski, GAUrban, DJYang, SM 1 H-pyrazol-1-yl-thiazoles as inhibitors of lactate dehydrogenase and methods of use thereof US Patent  US10954228 Publication Date 3/23/2021 
Target
Name:
L-lactate dehydrogenase A chain
Synonyms:
Cell proliferation-inducing gene 19 protein L-lactate dehydrogenase A Chain LDH-A LDHA Lactate dehydrogenase A (LDHA) | Renal carcinoma antigen NY-REN-59
Type:
Protein
Mol. Mass.:
36694.85
Organism:
Homo sapiens (Human)
Description:
P00338::PDB Code: 4ajp
Residue:
332
  
Inhibitor
Name:
BDBM488188
Synonyms:
2-(5-(cyclopropylmethyl)-3-(4- fluoro-3-(5,6,7,8- tetrahydronaphthalen-2-yl)phenyl)- 4-(3-fluoro-4- sulfamoylbenzyl)-1H-pyrazol- 1-yl)thiazole-4- carboxylic acid | US10954228, Compound 143
Type:
Small organic molecule
Emp. Form.:
C34H30F2N4O4S2
Mol. Mass.:
660.753
SMILES:
N[S+]([O-])(=O)c1ccc(Cc2c(CC3CC3)n(nc2-c2ccc(F)c(c2)-c2ccc3CCCCc3c2)-c2nc(cs2)C(O)=O)cc1F
: