Target
L-lactate dehydrogenase A chain
Ligand
BDBM488197
Substrate
Meas. Tech.
Biochemical Assay
IC50
<100±n/a nM
Citation
 Maloney, DJWaterson, AGBantukallu, GRBrimacombe, KRChristov, PDang, CVDarley-Usmar, VMHall, MHu, XJadhav, AJana, SKim, KMoore, WJMott, BTNeckers, LMSimeonov, ASulikowski, GAUrban, DJYang, SM 1 H-pyrazol-1-yl-thiazoles as inhibitors of lactate dehydrogenase and methods of use thereof US Patent  US10954228 Publication Date 3/23/2021 
Target
Name:
L-lactate dehydrogenase A chain
Synonyms:
Cell proliferation-inducing gene 19 protein L-lactate dehydrogenase A Chain LDH-A LDHA Lactate dehydrogenase A (LDHA) | Renal carcinoma antigen NY-REN-59
Type:
Protein
Mol. Mass.:
36694.85
Organism:
Homo sapiens (Human)
Description:
P00338::PDB Code: 4ajp
Residue:
332
  
Inhibitor
Name:
BDBM488197
Synonyms:
2-(3-(3-benzamido-4- fluorophenyl)-5- (cyclopropylmethyl)-4-(3- fluoro-4-sulfamoylbenzyl)- 1H-pyrazol-1-yl)thiazole-4- carboxylic acid | US10954228, Compound 152
Type:
Small organic molecule
Emp. Form.:
C31H26F2N5O4S2
Mol. Mass.:
634.695
SMILES:
N[SH+](=O)c1ccc(Cc2c(CC3CC3)n(nc2-c2ccc(F)c(NC(=O)c3ccccc3)c2)-c2nc(cs2)C(O)=O)cc1F
: