Target
L-lactate dehydrogenase A chain
Ligand
BDBM488207
Substrate
Meas. Tech.
Biochemical Assay
IC50
<100±n/a nM
Citation
 Maloney, DJWaterson, AGBantukallu, GRBrimacombe, KRChristov, PDang, CVDarley-Usmar, VMHall, MHu, XJadhav, AJana, SKim, KMoore, WJMott, BTNeckers, LMSimeonov, ASulikowski, GAUrban, DJYang, SM 1 H-pyrazol-1-yl-thiazoles as inhibitors of lactate dehydrogenase and methods of use thereof US Patent  US10954228 Publication Date 3/23/2021 
Target
Name:
L-lactate dehydrogenase A chain
Synonyms:
Cell proliferation-inducing gene 19 protein L-lactate dehydrogenase A Chain LDH-A LDHA Lactate dehydrogenase A (LDHA) | Renal carcinoma antigen NY-REN-59
Type:
Protein
Mol. Mass.:
36694.85
Organism:
Homo sapiens (Human)
Description:
P00338::PDB Code: 4ajp
Residue:
332
  
Inhibitor
Name:
BDBM488207
Synonyms:
2-(5-(cyclopropylmethyl)- 3-(4-fluoro-3-((5- methylthiophen-2-yl)ethynyl) phenyl)-4-(3-fluoro-4- sulfamoylbenzyl)-1H-pyrazol-1- yl)thiazole-4-carboxamide; 1H-NMR (d6-DMSO) 948; 8.13 (s, 1H), 7.75-7.54 (m, 3H), 7.62 (s, 2H), 7.38 (tr, 1H, J = 16 Hz), 7.36 (d, 1H, J = 4 Hz), 7.15 (d, 1H, J = 12 Hz), 7.06 (d, 1H, J = 8 Hz), 6.85 (d, 1H, J = 4 Hz), 4.18 (s, 2H), 3.18- 315 (m, 2H), 2.5 (s, 3H), 1.18-1.15 (m, 1H), 0.34-0.32 (m, 2H), 0.19-0.17 (m, 2H); MS (ES) 651.1 [M + H)+, | US10954228, Compound 162
Type:
Small organic molecule
Emp. Form.:
C31H26F2N5O2S3
Mol. Mass.:
634.762
SMILES:
Cc1ccc(s1)C#Cc1cc(ccc1F)-c1nn(c(CC2CC2)c1Cc1ccc(c(F)c1)[SH+](N)=O)-c1nc(cs1)C(N)=O
: