Target
Tyrosine-protein kinase JAK1
Ligand
BDBM431910
Substrate
Meas. Tech.
Biochemical Kinase Assay
Ki
0.050±n/a nM
Citation
 Fatheree, PRBrandt, GESmith, CSullivan, SDVan Orden, LJ JAK inhibitors containing a 4-membered heterocyclic amide US Patent  US10954237 Publication Date 3/23/2021 
Target
Name:
Tyrosine-protein kinase JAK1
Synonyms:
JAK-1 JAK1A JAK1_HUMAN Janus kinase 1 (JAK1) | Janus kinase 1 JAK1
Type:
Protein
Mol. Mass.:
133293.73
Organism:
Homo sapiens (Human)
Description:
P23458
Residue:
1154
  
Inhibitor
Name:
BDBM431910
Synonyms:
US10550118, Example 8-17 US11453668, Example 8-17
Type:
Small organic molecule
Emp. Form.:
C30H36FN7O2
Mol. Mass.:
545.6509
SMILES:
CCc1cc(O)c(F)cc1-c1ccc2c(n[nH]c2c1)-c1nc2C[C@@H](N(Cc2[nH]1)C(C)C)C(=O)N1CC(C1)N(C)C
: