Target
Bifunctional phosphoribosylaminoimidazole carboxylase/phosphoribosylaminoimidazole succinocarboxamide synthetase
Ligand
BDBM489194
Substrate
Meas. Tech.
Biochemical Assay
IC50
62.5±n/a nM
Citation
 Osborne, SLarge, J Oxazole derivatives for use in the treatment of cancer US Patent  US10961233 Publication Date 3/30/2021 
Target
Name:
Bifunctional phosphoribosylaminoimidazole carboxylase/phosphoribosylaminoimidazole succinocarboxamide synthetase
Synonyms:
ADE2 Multifunctional protein ADE2 PAIS | PUR6_HUMAN
Type:
Protein
Mol. Mass.:
47081.21
Organism:
Human
Description:
P22234
Residue:
425
  
Inhibitor
Name:
BDBM489194
Synonyms:
US10961233, Example 35
Type:
Small organic molecule
Emp. Form.:
C20H25ClN6O4
Mol. Mass.:
448.903
SMILES:
Nc1nc(co1)C(=O)Nc1cc(ccc1Cl)N1CCN(CC1)C(=O)OCCNC1CC1
: