Target
Leucine-rich repeat serine/threonine-protein kinase 2 [970-2527]
Ligand
BDBM254933
Substrate
Meas. Tech.
LanthaScreen Kinase Activity Assay
EC50
97±n/a nM
Citation
 PubChem, PCBedford, STChen, IWang, YWilliamson, DS Arylpyrrolopyridine derived compounds as LRRK2 inhibitors US Patent  US9675594 Publication Date 6/13/2017 
Target
Name:
Leucine-rich repeat serine/threonine-protein kinase 2 [970-2527]
Synonyms:
LRRK2 Leucine-rich repeat kinase 2 (LRRK2 t-WT) PARK8
Type:
Protein
Mol. Mass.:
177317.56
Organism:
Homo sapiens (Human)
Description:
Human LRRK2 variant (970-2527aa)
Residue:
1558
  
Inhibitor
Name:
BDBM254933
Synonyms:
US9499542, 16 | US9675594, 16
Type:
Small organic molecule
Emp. Form.:
C18H14N6
Mol. Mass.:
314.344
SMILES:
Cn1cc(Nc2cc(-c3ccccc3)c3c(c[nH]c3n2)C#N)cn1
: