Target
Leucine-rich repeat serine/threonine-protein kinase 2 [970-2527]
Ligand
BDBM254940
Substrate
Meas. Tech.
LanthaScreen Kinase Activity Assay
EC50
215±n/a nM
Citation
 PubChem, PCBedford, STChen, IWang, YWilliamson, DS Arylpyrrolopyridine derived compounds as LRRK2 inhibitors US Patent  US9675594 Publication Date 6/13/2017 
Target
Name:
Leucine-rich repeat serine/threonine-protein kinase 2 [970-2527]
Synonyms:
LRRK2 Leucine-rich repeat kinase 2 (LRRK2 t-WT) PARK8
Type:
Protein
Mol. Mass.:
177317.56
Organism:
Homo sapiens (Human)
Description:
Human LRRK2 variant (970-2527aa)
Residue:
1558
  
Inhibitor
Name:
BDBM254940
Synonyms:
US9499542, 23 | US9675594, 23
Type:
Small organic molecule
Emp. Form.:
C19H17N7
Mol. Mass.:
343.3852
SMILES:
Cc1cn(C)nc1Nc1cc(-c2ccnc(C)c2)c2c(c[nH]c2n1)C#N
: