Target
Fatty acid-binding protein, brain
Ligand
BDBM50468458
Substrate
Meas. Tech.
High Throughput Fluorescence Displacement Assay
Ki
60.0±n/a nM
Citation
 Ojima, IDeutsch, DKaczocha, MHu, KTong, SElmes, MYan, S Alpha-truxillic acid derivatives and pharmaceutical compositions thereof US Patent  US10968163 Publication Date 4/6/2021 
Target
Name:
Fatty acid-binding protein, brain
Synonyms:
B-FABP FABP7 FABPB | MRG
Type:
PROTEIN
Mol. Mass.:
14886.73
Organism:
Homo sapiens
Description:
ChEMBL_116822
Residue:
132
  
Inhibitor
Name:
BDBM50468458
Synonyms:
CHEMBL4285313 | US10968163, Compound 3b
Type:
Small organic molecule
Emp. Form.:
C26H24O5
Mol. Mass.:
416.4658
SMILES:
COc1ccc(COC(=O)[C@H]2[C@H]([C@@H]([C@@H]2c2ccccc2)C(O)=O)c2ccccc2)cc1
: