Target
Fatty acid-binding protein, brain
Ligand
BDBM50468475
Substrate
Meas. Tech.
High Throughput Fluorescence Displacement Assay
Ki
180±n/a nM
Citation
 Ojima, IDeutsch, DKaczocha, MHu, KTong, SElmes, MYan, S Alpha-truxillic acid derivatives and pharmaceutical compositions thereof US Patent  US10968163 Publication Date 4/6/2021 
Target
Name:
Fatty acid-binding protein, brain
Synonyms:
B-FABP FABP7 FABPB | MRG
Type:
PROTEIN
Mol. Mass.:
14886.73
Organism:
Homo sapiens
Description:
ChEMBL_116822
Residue:
132
  
Inhibitor
Name:
BDBM50468475
Synonyms:
CHEMBL4279887 | US10968163, Compound 3j
Type:
Small organic molecule
Emp. Form.:
C30H24O5
Mol. Mass.:
464.5086
SMILES:
OC(=O)[C@H]1[C@@H]([C@@H]([C@H]1c1ccccc1)C(=O)Oc1ccccc1-c1ccccc1O)c1ccccc1
: