Target
Fatty acid-binding protein, brain
Ligand
BDBM489714
Substrate
Meas. Tech.
High Throughput Fluorescence Displacement Assay
Ki
30.0±n/a nM
Citation
 Ojima, IDeutsch, DKaczocha, MHu, KTong, SElmes, MYan, S Alpha-truxillic acid derivatives and pharmaceutical compositions thereof US Patent  US10968163 Publication Date 4/6/2021 
Target
Name:
Fatty acid-binding protein, brain
Synonyms:
B-FABP FABP7 FABPB | MRG
Type:
PROTEIN
Mol. Mass.:
14886.73
Organism:
Homo sapiens
Description:
ChEMBL_116822
Residue:
132
  
Inhibitor
Name:
BDBM489714
Synonyms:
US10968163, Compound 3l
Type:
Small organic molecule
Emp. Form.:
C30H29O4
Mol. Mass.:
453.5494
SMILES:
[O-]C(=O)C1C(C(C1c1ccccc1)C(=O)O[C@@H]1CCCC[C@H]1c1ccccc1)c1ccccc1
: