Target
Fatty acid-binding protein 5
Ligand
BDBM489733
Substrate
Meas. Tech.
High Throughput Fluorescence Displacement Assay
Ki
60.0±n/a nM
Citation
 Ojima, IDeutsch, DKaczocha, MHu, KTong, SElmes, MYan, S Alpha-truxillic acid derivatives and pharmaceutical compositions thereof US Patent  US10968163 Publication Date 4/6/2021 
Target
Name:
Fatty acid-binding protein 5
Synonyms:
FABP5 Fatty acid binding protein epidermal | Fatty acid-binding protein 5 (FABP5)
Type:
Enzyme
Mol. Mass.:
15164.79
Organism:
Homo sapiens (Human)
Description:
Q01469
Residue:
135
  
Inhibitor
Name:
BDBM489733
Synonyms:
US10968163, Compound 4e
Type:
Small organic molecule
Emp. Form.:
C32H33O6
Mol. Mass.:
513.6014
SMILES:
COc1ccccc1C1C(C(C1C(=O)O[C@@H]1CCCC[C@H]1c1ccccc1)c1ccccc1OC)C([O-])=O
: