Target
Nuclear receptor ROR-gamma
Ligand
BDBM490926
Substrate
Meas. Tech.
ThermoFluor Assay
Kd
43.0±n/a nM
Citation
 Goldberg, SMartin, CLFennema, EGKummer, DANishimura, RTWoods, CRWolin, RLJones, WMFourie, AMXue, X Phenyl substituted pyrazoles as modulators of RORγt US Patent  US10975037 Publication Date 4/13/2021 
Target
Name:
Nuclear receptor ROR-gamma
Synonyms:
NR1F3 Nuclear receptor ROR-gamma (RORC) RAR-related orphan receptor C (RORc) RORG RZRG Retinoid-related orphan receptor-gamma (RORc)
Type:
Enzyme Catalytic Domain
Mol. Mass.:
58218.40
Organism:
Homo sapiens (Human)
Description:
P51449
Residue:
518
  
Inhibitor
Name:
BDBM490926
Synonyms:
(1r*,4r*)-1-((4-Chloro-5-(2-(difluoromethoxy)-4-(3,3,3-trifluoro-2,2-dimethylpropyl)phenyl)-1-ethyl-1H-pyrazole-3-carboxamido)methyl)-4-(methylsulfonyl)cyclohexane-1-carboxylic Acid | US10975037, Example 121
Type:
Small organic molecule
Emp. Form.:
C26H33ClF5N3O4S
Mol. Mass.:
614.068
SMILES:
CCn1nc(C(=O)NC[C@H]2CC[C@H](CC2)S(C)(=O)=O)c(Cl)c1-c1ccc(CC(C)(C)C(F)(F)F)cc1OC(F)F
: