Target
Leucyl-cystinyl aminopeptidase
Ligand
BDBM271211
Substrate
Meas. Tech.
Inhibition Activity Assay
IC50
1.90±n/a nM
Citation
 Kawaguchi, KIshihata, AInagaki, YTsuchiya, KHanadate, TKanai, AKaizawa, HKazami, JMorikawa, HHiramoto, MEnjo, KTakamatsu, H Pyridine derivative US Patent  US10975091 Publication Date 4/13/2021 
Target
Name:
Leucyl-cystinyl aminopeptidase
Synonyms:
Aminopeptidase Cystinyl aminopeptidase Insulin-regulated membrane aminopeptidase LCAP_HUMAN Leucyl-cystinyl aminopeptidase, pregnancy serum form Oxytocinase Placental leucine aminopeptidase
Type:
PROTEIN
Mol. Mass.:
117334.10
Organism:
Homo sapiens (Human)
Description:
ChEMBL_1473494
Residue:
1025
  
Inhibitor
Name:
BDBM271211
Synonyms:
US10059720, Example 26 | US10975091, Example 26
Type:
Small organic molecule
Emp. Form.:
C19H28N2O4
Mol. Mass.:
348.4366
SMILES:
CC(C)C[C@H](N)[C@](O)(Cc1cc(O[C@@H]2C[C@@H]3C[C@@H]3C2)ccn1)C(O)=O
: