Target
Protein arginine N-methyltransferase 5
Ligand
BDBM176869
Substrate
Meas. Tech.
PRMT5/MEP50 Enzyme Assays on Peptide Substrates
IC50
<100±n/a nM
Citation
 Duncan, KWChesworth, RBoriack-Sjodin, PAMunchhof, MJJin, L PRMT5 inhibitors and uses thereof US Patent  US10980794 Publication Date 4/20/2021 
Target
Name:
Protein arginine N-methyltransferase 5
Synonyms:
Human Flag-PRMT5/6His-MeP50 protein | PRMT5/MeP50
Type:
Protein
Mol. Mass.:
Description:
Components:
This complex has 2 components.
Component 1
Name:
Protein arginine N-methyltransferase 5
Synonyms:
ANM5_HUMAN HRMT1L5 JBP1 Protein arginine N-methyltransferase 5 (Flag-PRMT5) | SKB1
Type:
Protein
Mol. Mass.:
72548.80
Organism:
Homo sapiens (Human)
Description:
Full-length PRMT5 with FLAG tag fused directly to Ala 2 (MDYKDDDDK removed)
Residue:
636
  
Component 2
Name:
Protein arginine N-methyltransferase 5
Synonyms:
6His-MEP50 HRMT1L5 JBP1 PRMT5 | SKB1
Type:
Protein
Mol. Mass.:
37539.24
Organism:
Homo sapiens (Human)
Description:
Full-length MeP50 with His tag fused directly to Arg 2 of MEP50
Residue:
348
  
Inhibitor
Name:
BDBM176869
Synonyms:
US10307413, Compound 41 US10980794, Cmpd No 41 | US9675614, 41
Type:
Small organic molecule
Emp. Form.:
C27H37N3O3
Mol. Mass.:
451.601
SMILES:
CCN(C1CCOCC1)c1cccc(C(=O)NCC(O)CN2CCc3ccccc3C2)c1C
: