Target
Toll-like receptor 8
Ligand
BDBM254735
Substrate
Meas. Tech.
Pharmacological Assay
EC50
1.000±n/a nM
Citation
 Hoves, SWang, LYun, HZhang, WZhu, W Benzazepine dicarboxamide compounds US Patent  US9597333 Publication Date 3/21/2017 
Target
Name:
Toll-like receptor 8
Synonyms:
CD_antigen: CD288 TLR8_HUMAN | TRL8
Type:
Enzyme
Mol. Mass.:
119828.77
Organism:
Homo sapiens (Human)
Description:
Q9NR97
Residue:
1041
  
Inhibitor
Name:
BDBM254735
Synonyms:
US9475775, 2 | US9597333, 2
Type:
Small organic molecule
Emp. Form.:
C22H26N6O2
Mol. Mass.:
406.4808
SMILES:
CCCN(CCC)C(=O)C1=Cc2ccc(cc2N=C(N)C1)C(=O)Nc1cncnc1
: