Target
Toll-like receptor 8
Ligand
BDBM254763
Substrate
Meas. Tech.
Pharmacological Assay
EC50
2.00±n/a nM
Citation
 Hoves, SWang, LYun, HZhang, WZhu, W Benzazepine dicarboxamide compounds US Patent  US9597333 Publication Date 3/21/2017 
Target
Name:
Toll-like receptor 8
Synonyms:
CD_antigen: CD288 TLR8_HUMAN | TRL8
Type:
Enzyme
Mol. Mass.:
119828.77
Organism:
Homo sapiens (Human)
Description:
Q9NR97
Residue:
1041
  
Inhibitor
Name:
BDBM254763
Synonyms:
US9475775, 30 | US9597333, 30
Type:
Small organic molecule
Emp. Form.:
C25H30N4O3
Mol. Mass.:
434.5307
SMILES:
CCCN(CCC)C(=O)C1=Cc2ccc(cc2N=C(N)C1)C(=O)Nc1cccc(OC)c1
: