Target
Sodium channel protein type 1 subunit alpha
Ligand
BDBM492965
Substrate
Meas. Tech.
Sodium Influx Assay (In Vitro Assay)
IC50
245±n/a nM
Citation
 Andrez, JBurford, KNDehnhardt, CMFocken, TGrimwood, MEJia, QLofstrand, VASun, SWesolowski, SSWilson, MSZenova, AY Heteroaryl-substituted sulfonamide compounds and their use as therapeutic agents US Patent  US10981905 Publication Date 4/20/2021 
Target
Name:
Sodium channel protein type 1 subunit alpha
Synonyms:
NAC1 SCN1A Sodium (Site 1) Sodium channel protein type 1 subunit alpha Sodium channel protein type I subunit alpha Voltage-gated sodium channel subunit alpha Nav1.1
Type:
Protein
Mol. Mass.:
228952.47
Organism:
Homo sapiens (Human)
Description:
P35498
Residue:
2009
  
Inhibitor
Name:
BDBM492965
Synonyms:
5-((2-bromo-3,6-difluorobenzyl)amino)-3-fluoro-6-methyl-N-(thiazol-4-yl)pyridine-2-sulfonamide US11639351, Example 36
Type:
Small organic molecule
Emp. Form.:
C16H12BrF3N4O2S2
Mol. Mass.:
493.321
SMILES:
Cc1nc(c(F)cc1NCc1c(F)ccc(F)c1Br)S(=O)(=O)Nc1cscn1
: