Target
Ribose-phosphate pyrophosphokinase 1
Ligand
BDBM493379
Substrate
Meas. Tech.
PRS Enzyme Activity Inhibition Experiment
IC50
<100±n/a nM
Citation
 Lee, BCho, MLee, HJung, MOh, Y Heterocyclic compound, its preparation method, and pharmaceutical composition comprising the same US Patent  US10981917 Publication Date 4/20/2021 
Target
Name:
Ribose-phosphate pyrophosphokinase 1
Synonyms:
PRPS1 Ribose-phosphate pyrophosphokinase I
Type:
PROTEIN
Mol. Mass.:
34836.38
Organism:
Homo sapiens (Human)
Description:
ChEMBL_156521
Residue:
318
  
Inhibitor
Name:
BDBM493379
Synonyms:
US10981917, Example 80
Type:
Small organic molecule
Emp. Form.:
C15H19Cl2N3O
Mol. Mass.:
328.237
SMILES:
O[C@H]1CCCN[C@@H]1CCCn1cnc2cc(Cl)cc(Cl)c12
: